{"text_format":"1","workbook":"xlsx","n_sheets":9,"sheets":["Menü","Homogenitätsanalyse","Daten","Uniformitätsentwicklung","Gewichtsentwicklung","Sollgewichte","Dateneingabe","Impressum","Datenexport"],"not_rendered":{"charts":4,"images":10,"macros":1,"external_links":0,"defined_names":9,"comments":0,"pivot_tables":0},"unopened":[],"bounds":{"document_bytes":16777216,"sheet_cells":100000,"rows_first":2000,"rows_last":500,"rows_between":2000,"halvings":0,"cell_chars":16384,"cell_head_chars":4096},"cells_cut":0,"cells_raw":0,"read":"whole","date_system":"1900"}

{"sheet":"Menü","index":0,"n_rows":24,"n_cols":14,"rows_kept":24,"cut":false,"hidden":false,"merged":[[21,4,21,9],[23,8,23,9],[13,4,13,9]]}
[]
[]
[]
[null,null,null,null,null,null,null,null,null,null,null,null,null,"2.2"]
[]
[]
[]
[]
[]
[]
{"$rows_left_out":15}
{"sheet":"Homogenitätsanalyse","index":1,"n_rows":20,"n_cols":26,"rows_kept":20,"cut":false,"hidden":false,"merged":[[1,1,1,10],[2,1,2,2],[2,3,2,4],[3,1,3,2],[3,3,3,4],[3,6,3,9],[2,6,2,9],[5,1,5,9],[6,2,6,3],[6,4,6,5],[6,6,6,9],[7,2,7,3],[7,4,7,5],[7,6,7,9],[15,1,15,3],[16,1,16,3],[17,1,17,3],[18,1,18,3],[19,1,19,3],[14,4,14,5],[10,1,10,3],[11,1,11,3],[12,1,12,3],[13,1,13,3],[14,1,14,3],[9,1,9,5],[10,4,10,5],[11,4,11,5],[12,4,12,5],[13,4,13,5],[19,4,19,5],[15,4,15,5],[16,4,16,5],[17,4,17,5],[18,4,18,5]]}
[]
[null,"Herden- / Tiergruppendaten:",null,null,null,null,null,null,null,null,null,null,null,null,null,null,null,null,null,"Gewichtsklassen:","Von:","Bis:","Von-Bis:","Wert X","Normverteilung:","Anzahl pro Klasse:"]
[null,"Betriebskennung:  ",null,"Stall / Abteil:  ",null,"Tieranzahl: ","Herkunft: ",null,null,null,"Schlupfdatum: "]
[null,{"$f":"Menü!F23","v":0},null,{"$f":"Menü!F24","v":0},null,{"$f":"Menü!H23","v":0},{"$f":"Menü!H24","v":0},null,null,null,{"$f":"Menü!J23","v":"00:00:00"},null,null,null,null,null,null,null,null,1,{"$f":"ROUNDDOWN(E12,-1)","v":{"$error":"#N/A"}},{"$f":"ROUNDDOWN(E12,-1)+((ROUNDUP(E13,-1)-ROUNDDOWN(E12,-1))/10)","v":{"$error":"#N/A"}},{"$f":"U4&\" - \"&V4","v":{"$error":"#N/A"}},{"$f":"U4","v":{"$error":"#N/A"}},{"$f":"NORMDIST(X4,E$11,E$14,FALSE)","v":{"$error":"#N/A"}},{"$f":"VLOOKUP($B$8,Daten!$A$6:$X$115,15,FALSE)","v":{"$error":"#N/A"}}]
[null,null,null,null,null,null,null,null,null,null,null,null,null,null,null,null,null,null,null,2,{"$f":"ROUNDDOWN(E$12,-1)+((ROUNDUP(E$13,-1)-ROUNDDOWN(E$12,-1))/10)","v":{"$error":"#N/A"}},{"$f":"ROUNDDOWN(E$12,-1)+((ROUNDUP(E$13,-1)-ROUNDDOWN(E$12,-1))/10*2)","v":{"$error":"#N/A"}},{"$f":"U5&\" - \"&V5","v":{"$error":"#N/A"}},{"$f":"U5","v":{"$error":"#N/A"}},{"$error":"#N/A"},{"$f":"VLOOKUP($B$8,Daten!$A$6:$X$115,16,FALSE)","v":{"$error":"#N/A"}}]
[null,"Gewichtsaufnahmedaten:",null,null,null,null,null,null,null,null,null,null,null,null,null,null,null,null,null,3,{"$f":"ROUNDDOWN(E$12,-1)+((ROUNDUP(E$13,-1)-ROUNDDOWN(E$12,-1))/10*2)","v":{"$error":"#N/A"}},{"$f":"ROUNDDOWN(E$12,-1)+((ROUNDUP(E$13,-1)-ROUNDDOWN(E$12,-1))/10*3)","v":{"$error":"#N/A"}},{"$error":"#N/A"},{"$error":"#N/A"},{"$error":"#N/A"},{"$f":"VLOOKUP($B$8,Daten!$A$6:$X$115,17,FALSE)","v":{"$error":"#N/A"}}]
[null,"Aufnahmedatum:","Lebenstag:",null,"Lebenswoche:",null,"Anzahl gew. Tiere:",null,null,null,null,null,null,null,null,null,null,null,null,4,{"$f":"ROUNDDOWN(E$12,-1)+((ROUNDUP(E$13,-1)-ROUNDDOWN(E$12,-1))/10*3)","v":{"$error":"#N/A"}},{"$f":"ROUNDDOWN(E$12,-1)+((ROUNDUP(E$13,-1)-ROUNDDOWN(E$12,-1))/10*4)","v":{"$error":"#N/A"}},{"$error":"#N/A"},{"$error":"#N/A"},{"$error":"#N/A"},{"$f":"VLOOKUP($B$8,Daten!$A$6:$X$115,18,FALSE)","v":{"$error":"#N/A"}}]
[null,"1900-01-01",{"$f":"VLOOKUP($B$8,Daten!$A$6:$X$115,2,FALSE)","v":{"$error":"#N/A"}},null,{"$f":"VLOOKUP($B$8,Daten!$A$6:$X$115,3,FALSE)","v":{"$error":"#N/A"}},null,{"$f":"VLOOKUP($B$8,Daten!$A$6:$X$115,4,FALSE)","v":{"$error":"#N/A"}},null,null,null,null,null,null,null,null,null,null,null,null,5,{"$f":"ROUNDDOWN(E$12,-1)+((ROUNDUP(E$13,-1)-ROUNDDOWN(E$12,-1))/10*4)","v":{"$error":"#N/A"}},{"$f":" ROUNDDOWN(E$12,-1)+((ROUNDUP(E$13,-1)-ROUNDDOWN(E$12,-1))/10*5)","v":{"$error":"#N/A"}},{"$error":"#N/A"},{"$error":"#N/A"},{"$error":"#N/A"},{"$f":"VLOOKUP($B$8,Daten!$A$6:$X$115,19,FALSE)","v":{"$error":"#N/A"}}]
[null,null,null,null,null,null,null,null,null,null,null,null,null,null,null,null,null,null,null,6,{"$f":"ROUNDDOWN(E$12,-1)+((ROUNDUP(E$13,-1)-ROUNDDOWN(E$12,-1))/10*5)","v":{"$error":"#N/A"}},{"$f":" ROUNDDOWN(E$12,-1)+((ROUNDUP(E$13,-1)-ROUNDDOWN(E$12,-1))/10*6)","v":{"$error":"#N/A"}},{"$error":"#N/A"},{"$error":"#N/A"},{"$error":"#N/A"},{"$f":"VLOOKUP($B$8,Daten!$A$6:$X$115,20,FALSE)","v":{"$error":"#N/A"}}]
[null,"Gewichtsdaten:",null,null,null,null,null,null,null,null,null,null,null,null,null,null,null,null,null,7,{"$f":"ROUNDDOWN(E$12,-1)+((ROUNDUP(E$13,-1)-ROUNDDOWN(E$12,-1))/10*6)","v":{"$error":"#N/A"}},{"$f":"ROUNDDOWN(E$12,-1)+((ROUNDUP(E$13,-1)-ROUNDDOWN(E$12,-1))/10*7)","v":{"$error":"#N/A"}},{"$error":"#N/A"},{"$error":"#N/A"},{"$error":"#N/A"},{"$f":"VLOOKUP($B$8,Daten!$A$6:$X$115,21,FALSE)","v":{"$error":"#N/A"}}]
{"$rows_left_out":11}
{"sheet":"Daten","index":2,"n_rows":115,"n_cols":173,"rows_kept":115,"cut":false,"hidden":false,"merged":[[1,0,1,1],[1,2,1,3],[2,0,2,1],[2,2,2,3],[2,9,2,10],[2,4,2,5],[2,6,2,7],[1,4,1,5],[1,6,1,7]]}
[]
["Betriebskennung: ",null,{"$f":"Menü!F23","v":0},null,"Tieranzahl: ",null,{"$f":"Menü!H23","v":0}]
["Stall / Abteil: ",null,{"$f":"Menü!F24","v":0},null,"Herkunft: ",null,{"$f":"Menü!H24","v":0},null,null,"Schlupfdatum: ",null,{"$f":"Menü!J23","v":"00:00:00"}]
[]
["Aufnahme-datum","Lebens-     tag ","Lebens-woche","Anzahl    gewogener Tiere","Mittelwert","Minimum","Maximum","Standart-abweichung","Variationakoeffizient:","Sollgewicht","Sollgewichts-erfüllung","Uniformität","Anteil Tiere mit niedrigem Gewicht","Anzahl Tiere Außerhalb 80%:","Anzahl Tiere Klasse 1:","Anzahl Tiere Klasse 2:","Anzahl Tiere Klasse 3:","Anzahl Tiere Klasse 4:","Anzahl Tiere Klasse 5:","Anzahl Tiere Klasse 6:","Anzahl Tiere Klasse 7:","Anzahl Tiere Klasse 8:","Anzahl Tiere Klasse 9:","Anzahl Tiere Klasse 10:","# 1","# 2","# 3","# 4","# 5","# 6","# 7","# 8","# 9","# 10","# 11","# 12","# 13","# 14","# 15","# 16","# 17","# 18","# 19","# 20","# 21","# 22","# 23","# 24","# 25","# 26","# 27","# 28","# 29","# 30","# 31","# 32","# 33","# 34","# 35","# 36","# 37","# 38","# 39","# 40","# 41","# 42","# 43","# 44","# 45","# 46","# 47","# 48","# 49","# 50","# 51","# 52","# 53","# 54","# 55","# 56","# 57","# 58","# 59","# 60","# 61","# 62","# 63","# 64","# 65","# 66","# 67","# 68","# 69","# 70","# 71","# 72","# 73","# 74","# 75","# 76","# 77","# 78","# 79","# 80","# 81","# 82","# 83","# 84","# 85","# 86","# 87","# 88","# 89","# 90","# 91","# 92","# 93","# 94","# 95","# 96","# 97","# 98","# 99","# 100","# 101","# 102","# 103","# 104","# 105","# 106","# 107","# 108","# 109","# 110","# 111","# 112","# 113","# 114","# 115","# 116","# 117","# 118","# 119","# 120","# 121","# 122","# 123","# 124","# 125","# 126","# 127","# 128","# 129","# 130","# 131","# 132","# 133","# 134","# 135","# 136","# 137","# 138","# 139","# 140","# 141","# 142","# 143","# 144","# 145","# 146","# 147","# 148","# 149"]
[null,{"$f":"A6-L$3","v":0},{"$f":"ROUND(ROUNDUP((A6-L$3)/7,1),1)","v":0},{"$f":"COUNTIF(Y6:FQ6,\">0\")","v":0},{"$f":"ROUND(AVERAGE(Y6:FQ6),0)","v":{"$error":"#DIV/0!"}},{"$f":"MIN(Y6:FQ6)","v":0},{"$f":"MAX(Y6:FQ6)","v":0},{"$f":"ROUND(STDEV(Y6:FQ6),0)","v":{"$error":"#DIV/0!"}},{"$f":"ROUND(H6/E6,4)","v":{"$error":"#DIV/0!"}},{"$f":"VLOOKUP(C6,Gewichtsentwicklung!P$6:R$568,3,FALSE)","v":{"$error":"#N/A"}},{"$f":"ROUND(E6/J6,4)","v":{"$error":"#DIV/0!"}},{"$f":"ROUND((D6-N6)/D6,4)","v":{"$error":"#DIV/0!"}},{"$f":"ROUND(COUNTIF(Y6:FQ6,\"<\"&J6*0.9)/D6,4)","v":{"$error":"#DIV/0!"}},{"$f":"COUNTIF(Y6:FQ6,\"<\"&E6*0.9)+COUNTIF(Y6:FQ6,\">\"&E6*1.1)","v":0},{"$f":"COUNTIF(Y6:FQ6,\">=\"&ROUNDDOWN($F6,-1))-COUNTIF(Y6:FQ6,\">=\"&ROUNDDOWN($F6,-1)+((ROUNDUP($G6,-1)-ROUNDDOWN($F6,-1))/10))","v":0},{"$f":"COUNTIF(Y6:FQ6,\">=\"&ROUNDDOWN($F6,-1)+((ROUNDUP($G6,-1)-ROUNDDOWN($F6,-1))/10))-COUNTIF(Y6:FQ6,\">=\"&ROUNDDOWN($F6,-1)+((ROUNDUP($G6,-1)-ROUNDDOWN($F6,-1))/10*2))","v":0},{"$f":"COUNTIF(Y6:FQ6,\">=\"&ROUNDDOWN($F6,-1)+((ROUNDUP($G6,-1)-ROUNDDOWN($F6,-1))/10*2))-COUNTIF(Y6:FQ6,\">=\"&ROUNDDOWN($F6,-1)+((ROUNDUP($G6,-1)-ROUNDDOWN($F6,-1))/10*3))","v":0},{"$f":"COUNTIF(Y6:FQ6,\">=\"&ROUNDDOWN($F6,-1)+((ROUNDUP($G6,-1)-ROUNDDOWN($F6,-1))/10*3))-COUNTIF(Y6:FQ6,\">=\"&ROUNDDOWN($F6,-1)+((ROUNDUP($G6,-1)-ROUNDDOWN($F6,-1))/10*4))","v":0},{"$f":"COUNTIF(Y6:FQ6,\">=\"&ROUNDDOWN($F6,-1)+((ROUNDUP($G6,-1)-ROUNDDOWN($F6,-1))/10*4))-COUNTIF(Y6:FQ6,\">=\"&ROUNDDOWN($F6,-1)+((ROUNDUP($G6,-1)-ROUNDDOWN($F6,-1))/10*5))","v":0},{"$f":"COUNTIF(Y6:FQ6,\">=\"&ROUNDDOWN($F6,-1)+((ROUNDUP($G6,-1)-ROUNDDOWN($F6,-1))/10*5))-COUNTIF(Y6:FQ6,\">=\"&ROUNDDOWN($F6,-1)+((ROUNDUP($G6,-1)-ROUNDDOWN($F6,-1))/10*6))","v":0},{"$f":"COUNTIF(Y6:FQ6,\">=\"&ROUNDDOWN($F6,-1)+((ROUNDUP($G6,-1)-ROUNDDOWN($F6,-1))/10*6))-COUNTIF(Y6:FQ6,\">=\"&ROUNDDOWN($F6,-1)+((ROUNDUP($G6,-1)-ROUNDDOWN($F6,-1))/10*7))","v":0},{"$f":"COUNTIF(Y6:FQ6,\">=\"&ROUNDDOWN($F6,-1)+((ROUNDUP($G6,-1)-ROUNDDOWN($F6,-1))/10*7))-COUNTIF(Y6:FQ6,\">=\"&ROUNDDOWN($F6,-1)+((ROUNDUP($G6,-1)-ROUNDDOWN($F6,-1))/10*8))","v":0},{"$f":"COUNTIF(Y6:FQ6,\">=\"&ROUNDDOWN($F6,-1)+((ROUNDUP($G6,-1)-ROUNDDOWN($F6,-1))/10*8))-COUNTIF(Y6:FQ6,\">=\"&ROUNDDOWN($F6,-1)+((ROUNDUP($G6,-1)-ROUNDDOWN($F6,-1))/10*9))","v":0},{"$f":"COUNTIF(Y6:FQ6,\">0\"&ROUNDDOWN($F6,-1)+((ROUNDUP($G6,-1)-ROUNDDOWN($F6,-1))/10*9))-COUNTIF(Y6:FQ6,\">\"&ROUNDUP($G6,-1))","v":0}]
[null,0,0,0,{"$error":"#DIV/0!"},0,0,{"$error":"#DIV/0!"},{"$error":"#DIV/0!"},{"$f":"VLOOKUP(C7,Gewichtsentwicklung!P$6:R$568,3,FALSE)","v":{"$error":"#N/A"}},{"$error":"#DIV/0!"},{"$error":"#DIV/0!"},{"$error":"#DIV/0!"},0,0,0,0,0,0,0,0,0,0,0]
[null,0,0,0,{"$error":"#DIV/0!"},0,0,{"$error":"#DIV/0!"},{"$error":"#DIV/0!"},{"$f":"VLOOKUP(C8,Gewichtsentwicklung!P$6:R$568,3,FALSE)","v":{"$error":"#N/A"}},{"$error":"#DIV/0!"},{"$error":"#DIV/0!"},{"$error":"#DIV/0!"},0,0,0,0,0,0,0,0,0,0,0]
[null,0,0,0,{"$error":"#DIV/0!"},0,0,{"$error":"#DIV/0!"},{"$error":"#DIV/0!"},{"$f":"VLOOKUP(C9,Gewichtsentwicklung!P$6:R$568,3,FALSE)","v":{"$error":"#N/A"}},{"$error":"#DIV/0!"},{"$error":"#DIV/0!"},{"$error":"#DIV/0!"},0,0,0,0,0,0,0,0,0,0,0]
[null,0,0,0,{"$error":"#DIV/0!"},0,0,{"$error":"#DIV/0!"},{"$error":"#DIV/0!"},{"$f":"VLOOKUP(C10,Gewichtsentwicklung!P$6:R$568,3,FALSE)","v":{"$error":"#N/A"}},{"$error":"#DIV/0!"},{"$error":"#DIV/0!"},{"$error":"#DIV/0!"},0,0,0,0,0,0,0,0,0,0,0]
{"$rows_left_out":106}
{"sheet":"Uniformitätsentwicklung","index":3,"n_rows":4,"n_cols":11,"rows_kept":4,"cut":false,"hidden":false,"merged":[[1,2,1,11],[2,2,2,3],[2,4,2,5],[2,6,2,7],[2,8,2,9],[2,10,2,11],[3,2,3,3],[3,4,3,5],[3,6,3,7],[3,8,3,9],[3,10,3,11]]}
[]
[null,null,"Herden- / Tiergruppendaten:"]
[null,null,"Betriebskennung:  ",null,"Stall / Abteil:  ",null,"Tieranzahl: ",null,"Herkunft: ",null,"Schlupfdatum: "]
[null,null,{"$f":"Menü!F23","v":0},null,{"$f":"Menü!F24","v":0},null,{"$f":"Menü!H23","v":0},null,{"$f":"Menü!H24","v":0},null,{"$f":"Menü!J23","v":"00:00:00"}]

{"sheet":"Gewichtsentwicklung","index":4,"n_rows":566,"n_cols":27,"rows_kept":566,"cut":false,"hidden":false,"merged":[[1,2,1,11],[2,2,2,3],[2,4,2,5],[2,6,2,7],[2,8,2,9],[2,10,2,11],[3,2,3,3],[3,4,3,5],[3,6,3,7],[3,8,3,9],[3,10,3,11]]}
[]
[null,null,"Herden- / Tiergruppendaten:",null,null,null,null,null,null,null,null,null,null,null,null,null,null,145,null,{"$f":"MAX(Daten!C6:C115)","v":0}]
[null,null,"Betriebskennung:  ",null,"Stall / Abteil:  ",null,"Tieranzahl: ",null,"Herkunft: ",null,"Schlupfdatum: "]
[null,null,{"$f":"Menü!F23","v":0},null,{"$f":"Menü!F24","v":0},null,{"$f":"Menü!H23","v":0},null,{"$f":"Menü!H24","v":0},null,{"$f":"Menü!J23","v":"00:00:00"}]
[]
[null,null,null,null,null,null,null,null,null,null,null,null,null,null,null,{"$f":"ROUND(Q6,1)","v":0},0,{"$f":"VLOOKUP(Menü!H$24,Sollgewichte!A$4:CD$13,Q6+2,FALSE)","v":{"$error":"#N/A"}},{"$f":"R6*0.95","v":{"$error":"#N/A"}},{"$f":"R6","v":{"$error":"#N/A"}},{"$f":"VLOOKUP(P6,Daten!C$6:E$115,3,FALSE)","v":{"$error":"#DIV/0!"}},{"$f":"VLOOKUP(P6,Daten!C$6:L$115,10,FALSE)","v":{"$error":"#DIV/0!"}},{"$f":"VLOOKUP(P6,Daten!C$6:M$115,11,FALSE)","v":{"$error":"#DIV/0!"}},0.05,0.1,0.8,0.85]
[null,null,null,null,null,null,null,null,null,null,null,null,null,null,null,{"$f":"ROUND(Q7,1)","v":0.2},{"$f":"Q6+0.2","v":0.2},{"$f":"ROUND(R6+(R13-R6)/7,0)","v":{"$error":"#N/A"}},{"$f":"R7*0.95","v":{"$error":"#N/A"}},{"$f":"R7","v":{"$error":"#N/A"}},{"$f":"VLOOKUP(P7,Daten!C$6:E$115,3,FALSE)","v":{"$error":"#N/A"}},{"$f":"VLOOKUP(P7,Daten!C$6:L$115,10,FALSE)","v":{"$error":"#N/A"}},{"$f":"VLOOKUP(P7,Daten!C$6:M$115,11,FALSE)","v":{"$error":"#N/A"}},0.05,0.1,0.8,0.85]
[null,null,null,null,null,null,null,null,null,null,null,null,null,null,null,0.3,{"$f":"Q7+0.1","v":0.30000000000000004},{"$f":"ROUND(R6+(R13-R6)/7*2,0)","v":{"$error":"#N/A"}},{"$error":"#N/A"},{"$error":"#N/A"},{"$f":"VLOOKUP(P8,Daten!C$6:E$115,3,FALSE)","v":{"$error":"#N/A"}},{"$f":"VLOOKUP(P8,Daten!C$6:L$115,10,FALSE)","v":{"$error":"#N/A"}},{"$f":"VLOOKUP(P8,Daten!C$6:M$115,11,FALSE)","v":{"$error":"#N/A"}},0.05,0.1,0.8,0.85]
[null,null,null,null,null,null,null,null,null,null,null,null,null,null,null,0.5,{"$f":"Q8+0.2","v":0.5},{"$f":"ROUND(R6+(R13-R6)/7*3,0)","v":{"$error":"#N/A"}},{"$error":"#N/A"},{"$error":"#N/A"},{"$f":"VLOOKUP(P9,Daten!C$6:E$115,3,FALSE)","v":{"$error":"#N/A"}},{"$f":"VLOOKUP(P9,Daten!C$6:L$115,10,FALSE)","v":{"$error":"#N/A"}},{"$f":"VLOOKUP(P9,Daten!C$6:M$115,11,FALSE)","v":{"$error":"#N/A"}},0.05,0.1,0.8,0.85]
[null,null,null,null,null,null,null,null,null,null,null,null,null,null,null,0.6,{"$f":"Q9+0.1","v":0.6},{"$f":"ROUND(R6+(R13-R6)/7*4,0)","v":{"$error":"#N/A"}},{"$error":"#N/A"},{"$error":"#N/A"},{"$f":"VLOOKUP(P10,Daten!C$6:E$115,3,FALSE)","v":{"$error":"#N/A"}},{"$f":"VLOOKUP(P10,Daten!C$6:L$115,10,FALSE)","v":{"$error":"#N/A"}},{"$f":"VLOOKUP(P10,Daten!C$6:M$115,11,FALSE)","v":{"$error":"#N/A"}},0.05,0.1,0.8,0.85]
{"$rows_left_out":557}
{"sheet":"Sollgewichte","index":5,"n_rows":15,"n_cols":82,"rows_kept":15,"cut":false,"hidden":false,"merged":[[1,81,2,81],[1,70,2,70],[1,71,2,71],[1,72,2,72],[1,73,2,73],[1,74,2,74],[1,75,2,75],[1,76,2,76],[1,77,2,77],[1,78,2,78],[1,79,2,79],[1,80,2,80],[1,69,2,69],[1,58,2,58],[1,59,2,59],[1,60,2,60],[1,61,2,61],[1,62,2,62],[1,63,2,63],[1,64,2,64],[1,65,2,65],[1,66,2,66],[1,67,2,67],[1,68,2,68],[1,57,2,57],[1,46,2,46],[1,47,2,47],[1,48,2,48],[1,49,2,49],[1,50,2,50],[1,51,2,51],[1,52,2,52],[1,53,2,53],[1,54,2,54],[1,55,2,55],[1,56,2,56],[1,45,2,45],[1,34,2,34],[1,35,2,35],[1,36,2,36],[1,37,2,37],[1,38,2,38],[1,39,2,39],[1,40,2,40],[1,41,2,41],[1,42,2,42],[1,43,2,43],[1,44,2,44],[1,33,2,33],[1,22,2,22],[1,23,2,23],[1,24,2,24],[1,25,2,25],[1,26,2,26],[1,27,2,27],[1,28,2,28],[1,29,2,29],[1,30,2,30],[1,31,2,31],[1,32,2,32],[1,21,2,21],[1,10,2,10],[1,11,2,11],[1,12,2,12],[1,13,2,13],[1,14,2,14],[1,15,2,15],[1,16,2,16],[1,17,2,17],[1,18,2,18],[1,19,2,19],[1,20,2,20],[1,9,2,9],[1,1,2,1],[1,3,2,3],[1,4,2,4],[1,5,2,5],[1,6,2,6],[1,7,2,7],[1,8,2,8],[1,2,2,2]]}
[]
["Lebenswoche: ",0,1,2,3,4,5,6,7,8,9,10,11,12,13,14,15,16,17,18,19,20,21,22,23,24,25,26,27,28,29,30,31,32,33,34,35,36,37,38,39,40,41,42,43,44,45,46,47,48,49,50,51,52,53,54,55,56,57,58,59,60,61,62,63,64,65,66,67,68,69,70,71,72,73,74,75,76,77,78,79,80]
[" Herkunft:"]
["LB Classic Plus",40,75,130,195,275,370,480,590,695,795,890,980,1068,1153,1235,1315,1395,1475,1565,1655,1740,1815,1894,1934,1974,1989,2004,2011,2017,2022,2027,2032,2037,2042,2047,2052,2056,2060,2064,2068,2072,2076,2080,2084,2088,2092,2096,2100,2104,2108,2112,2116,2120,2124,2128,2132,2136,2140,2144,2148,2152,2156,2160,2164,2168,2172,2176,2180,2184,2188,2192,2196,2200,2202,2204,2206,2208,2210,2212,2214,2216]
["LB Classic/ Tetra SL",40,75,130,195,275,367,475,583,685,782,874,961,1043,1123,1197,1264,1330,1400,1475,1555,1640,1711,1790,1830,1870,1885,1900,1905,1911,1915,1920,1923,1925,1928,1931,1933,1935,1938,1940,1943,1945,1948,1951,1953,1955,1958,1960,1963,1965,1968,1971,1973,1975,1978,1980,1984,1985,1989,1991,1993,1995,1998,2000,2003,2005,2008,2011,2013,2015,2018,2020,2023,2025,2028,2031,2033,2035,2038,2040,2043,2045]
["LB light",40,75,125,190,270,360,465,570,670,765,855,940,1020,1098,1171,1236,1301,1369,1443,1521,1604,1673,1751,1790,1829,1844,1858,1863,1869,1873,1878,1881,1883,1886,1889,1891,1893,1895,1897,1900,1902,1905,1908,1910,1912,1915,1917,1920,1922,1925,1928,1930,1932,1934,1936,1939,1942,1945,1947,1949,1951,1954,1956,1959,1961,1964,1967,1969,1971,1974,1976,1978,1980,1983,1986,1988,1990,1993,1995,1998,2000]
["Lohmann Tradition/Silver",40,76,132,199,280,374,484,594,698,797,890,979,1062,1144,1219,1287,1355,1426,1502,1584,1670,1743,1823,1868,1906,1922,1935,1940,1946,1951,1955,1958,1962,1965,1968,1971,1974,1977,1980,1983,1986,1989,1993,1995,1997,1999,2001,2003,2005,2007,2009,2011,2013,2015,2017,2019,2021,2022,2023,2024,2025,2026,2027,2028,2029,2030,2031,2032,2033,2034,2035,2036,2037,2038,2039,2040,2041,2042,2043,2044,2045]
["Lohmann Sandy",40,75,127,190,271,355,452,558,658,758,853,935,1009,1072,1130,1183,1230,1280,1333,1394,1459,1529,1582,1627,1668,1700,1725,1747,1768,1784,1795,1801,1806,1809,1812,1815,1818,1821,1824,1827,1830,1833,1836,1839,1842,1845,1848,1851,1854,1855,1856,1857,1858,1859,1860,1861,1862,1863,1864,1865,1866,1867,1868,1869,1870,1871,1872,1873,1874,1875,1876,1877,1878,1879,1880,1881,1882,1883,1884,1885,1886]
["LSL Classic",40,75,125,187,257,337,429,529,624,719,809,887,957,1017,1072,1122,1167,1214,1264,1322,1386,1450,1500,1540,1580,1610,1630,1650,1670,1690,1700,1705,1710,1713,1715,1718,1720,1723,1725,1728,1730,1733,1735,1738,1740,1743,1745,1748,1750,1751,1753,1754,1755,1756,1758,1759,1760,1761,1763,1764,1765,1766,1768,1769,1770,1771,1773,1774,1775,1776,1778,1779,1780,1781,1783,1784,1785,1786,1788,1789,1790]
["Novogen brown classic",40,65,110,180,270,365,470,570,660,750,840,930,1020,1110,1190,1270,1350,1430,1500,1580,1640,1685,1720,1745,1765,1780,1790,1805,1815,1820,1820,1825,1825,1825,1830,1830,1835,1835,1840,1840,1840,1845,1845,1850,1850,1850,1855,1855,1860,1860,1860,1865,1865,1865,1870,1870,1875,1875,1880,1880,1880,1885,1885,1890,1890,1890,1895,1895,1900,1900,1900,1905,1905,1910,1910,1910,1915,1915,1920,1920,1920]
{"$rows_left_out":6}
{"sheet":"Dateneingabe","index":6,"n_rows":20,"n_cols":22,"rows_kept":20,"cut":false,"hidden":false,"merged":[[6,14,6,15],[7,14,7,15],[8,14,8,15],[13,14,13,17],[11,14,12,17],[8,16,8,17],[19,3,19,6],[19,8,19,11],[1,14,1,17],[2,14,2,15],[3,14,3,15],[4,14,4,15],[1,1,1,12],[2,1,2,2],[14,14,17,16],[2,16,2,17],[3,16,3,17],[4,16,4,17],[5,16,5,17],[6,16,6,17],[7,16,7,17],[5,14,5,15]]}
[]
[null,"Tiergewichte in g:",null,null,null,null,null,null,null,null,null,null,null,null,"Herden- / Tiergruppendaten:"]
[null,"Tier:",null,0,1,2,3,4,5,6,7,8,9,null,"Stall / Abteil:",null,{"$f":"Menü!F24","v":0}]
[null,"x",null,".",null,null,null,null,null,null,null,null,null,null,"Tieranzahl:",null,{"$f":"Menü!H23","v":0}]
[null,"1x",null,null,null,null,null,null,null,null,null,null,null,null,"Herkunft:",null,{"$f":"Menü!H24","v":0}]
[null,"2x",null,null,null,null,null,null,null,null,null,null,null,null,"Schlupfdatum:",null,{"$f":"Menü!J23","v":"00:00:00"}]
[null,"3x",null,null,null,null,null,null,null,null,null,null,null,null,"Aufnahmedatum:"]
[null,"4x",null,null,null,null,null,null,null,null,null,null,null,null,"Lebenswoche:",null,{"$f":"ROUND(ROUNDUP((Q7-Menü!J23)/7,1),1)","v":0}]
[null,"5x",null,null,null,null,null,null,null,null,null,null,null,null,"Sollgewicht:",null,{"$f":"VLOOKUP(Q8,Gewichtsentwicklung!P6:R566,3,FALSE)","v":{"$error":"#N/A"}}]
[null,"6x"]
{"$rows_left_out":11}
{"sheet":"Impressum","index":7,"n_rows":16,"n_cols":3,"rows_kept":16,"cut":false,"hidden":false,"merged":[[10,1,10,2],[12,1,12,2]]}
[]
[]
[]
[]
[]
[]
[]
[]
[]
[]
{"$rows_left_out":7}
{"sheet":"Datenexport","index":8,"n_rows":1,"n_cols":179,"rows_kept":1,"cut":false,"hidden":false,"merged":[]}
["Exportdatum:","Betriebskennung:","Stall / Abteil:","Tieranzahl:","Herkunft:","Schlupfdatum:","Aufnahmedatum:","Lebens-   tag: ","Lebens-woche:","Anzahl    gewogener Tiere:","Mittelwert:","Minimum:","Maximum:","Standart-abweichung:","Variationa-koeffizient:","Sollgewicht:","Sollgewichts-erfüllung:","Uniformität:","Anteil Tiere mit niedrigem Gewicht:","Anzahl Tiere Außerhalb 80%:","Anzahl Tiere Klasse 1:","Anzahl Tiere Klasse 2:","Anzahl Tiere Klasse 3:","Anzahl Tiere Klasse 4:","Anzahl Tiere Klasse 5:","Anzahl Tiere Klasse 6:","Anzahl Tiere Klasse 7:","Anzahl Tiere Klasse 8:","Anzahl Tiere Klasse 9:","Anzahl Tiere Klasse 10:","# 1","# 2","# 3","# 4","# 5","# 6","# 7","# 8","# 9","# 10","# 11","# 12","# 13","# 14","# 15","# 16","# 17","# 18","# 19","# 20","# 21","# 22","# 23","# 24","# 25","# 26","# 27","# 28","# 29","# 30","# 31","# 32","# 33","# 34","# 35","# 36","# 37","# 38","# 39","# 40","# 41","# 42","# 43","# 44","# 45","# 46","# 47","# 48","# 49","# 50","# 51","# 52","# 53","# 54","# 55","# 56","# 57","# 58","# 59","# 60","# 61","# 62","# 63","# 64","# 65","# 66","# 67","# 68","# 69","# 70","# 71","# 72","# 73","# 74","# 75","# 76","# 77","# 78","# 79","# 80","# 81","# 82","# 83","# 84","# 85","# 86","# 87","# 88","# 89","# 90","# 91","# 92","# 93","# 94","# 95","# 96","# 97","# 98","# 99","# 100","# 101","# 102","# 103","# 104","# 105","# 106","# 107","# 108","# 109","# 110","# 111","# 112","# 113","# 114","# 115","# 116","# 117","# 118","# 119","# 120","# 121","# 122","# 123","# 124","# 125","# 126","# 127","# 128","# 129","# 130","# 131","# 132","# 133","# 134","# 135","# 136","# 137","# 138","# 139","# 140","# 141","# 142","# 143","# 144","# 145","# 146","# 147","# 148","# 149"]